{"text_format":"1","workbook":"xlsx","n_sheets":10,"sheets":["Invoer_waarden","Resultaten_CCNR1_CCNR0","Resultaten_CCNR2_","Uitleg_resultaten","CBA figures","Results","Key Data","Emission factors","Ship segment (Data)","Shi Segment (Peter)"],"not_rendered":{"charts":22,"images":9,"macros":1,"external_links":1,"defined_names":115,"comments":6,"pivot_tables":0},"unopened":[],"bounds":{"document_bytes":16777216,"sheet_cells":100000,"rows_first":2000,"rows_last":500,"rows_between":2000,"halvings":0,"cell_chars":16384,"cell_head_chars":4096},"cells_cut":0,"cells_raw":0,"read":"whole","date_system":"1900"}

{"sheet":"Invoer_waarden","index":0,"n_rows":67,"n_cols":10,"rows_kept":67,"cut":false,"hidden":false,"merged":[]}
[]
[]
[]
[]
[]
[]
[]
[]
{"$rows_left_out":60}
{"sheet":"Resultaten_CCNR1_CCNR0","index":1,"n_rows":154,"n_cols":12,"rows_kept":154,"cut":false,"hidden":false,"merged":[]}
[null,"Resultaten voor een CCNR1/CCNR0 motor"]
[null,"Kosten (mil Euro) voor schippers over 15 jaar"]
[null,{"$f":"Invoer_waarden!$D$45&\" - \" &Invoer_waarden!$G$63","v":"Motor vessels dry cargo 110 m ship - normal fuel use - Diesel"}]
[null,{"$f":"IF(Invoer_waarden!$G$63='Ship segment (Data)'!$S$18,'Ship segment (Data)'!$T$19,'Ship segment (Data)'!$T$18)","v":"_"}]
[]
[]
[]
[]
{"$rows_left_out":147}
{"sheet":"Resultaten_CCNR2_","index":2,"n_rows":161,"n_cols":13,"rows_kept":161,"cut":false,"hidden":false,"merged":[[38,11,38,18],[73,2,73,14],[2,11,2,18]]}
[null,null,"Resultaten voor een CCNR2 motor"]
[null,null,{"$f":"Resultaten_CCNR1_CCNR0!B2","v":"Kosten (mil Euro) voor schippers over 15 jaar"}]
[null,null,{"$f":"Invoer_waarden!$D$45&\" - \" &Invoer_waarden!$G$63","v":"Motor vessels dry cargo 110 m ship - normal fuel use - Diesel"}]
[null,null,{"$f":"IF(Invoer_waarden!$G$63='Ship segment (Data)'!$S$18,'Ship segment (Data)'!$T$19,'Ship segment (Data)'!$T$18)","v":"_"}]
[]
[]
[]
[]
{"$rows_left_out":154}
{"sheet":"Uitleg_resultaten","index":3,"n_rows":2,"n_cols":2,"rows_kept":2,"cut":false,"hidden":false,"merged":[]}
[]
[null,"Uitleg resultaten"]

{"sheet":"CBA figures","index":4,"n_rows":117,"n_cols":28,"rows_kept":117,"cut":false,"hidden":true,"merged":[[46,2,46,4],[28,2,28,4],[29,2,29,4],[30,2,30,4],[31,2,31,4],[45,2,45,4],[1,2,1,4],[2,2,2,4],[3,2,3,4],[4,2,4,4],[5,2,5,4],[6,2,6,4],[7,2,7,4],[8,2,8,4],[9,2,9,4],[10,2,10,4],[11,2,11,4],[12,2,12,4],[13,2,13,4],[14,2,14,4],[15,2,15,4],[16,2,16,4],[17,2,17,4],[19,2,19,4],[20,2,20,4],[36,4,40,4],[22,2,22,4],[23,2,23,4],[24,2,24,4],[25,2,25,4],[26,2,26,4]]}
[null,null,"Diesel (baseline)- Stage 5","Diesel baseline CCNR (2) at revision","Diesel baseline CCNR (0) at revision",null,"LNG mono fuel","LNG dual fuel",null,null,"SCR on Diesel baseline CCNR 2 at revision","SCR on Diesel baseline CCNR 0 at revision",null,null,"SCR/ DPF on Diesel baseline CCNR (2) at revision","SCR/ DPF on Diesel baseline CCNR 0 at revision",null,"Compatible prominent segments for Right Size","Diesel elctric (2x 40%)","Battery electric",null,null,"FWE (CCR2)","FWE (CCR0)",null,null,"GTL (CCNR2)","GTL (CCNR0)"]
["Legend","CE Delft Segment",{"$f":"INDEX('Shi Segment (Peter)'!$A$3:$A$20,MATCH($C$3,'Shi Segment (Peter)'!$B$3:$B$20,0))","v":"H"}]
["Purple - Independent value","Vessel Class",{"$f":"'Ship segment (Data)'!Z5","v":"Motor vessels dry cargo 110 m ship"}]
["Yellow - Own calculation","Propulsion power range (Kw)",{"$f":"INDEX('Shi Segment (Peter)'!$C$3:$C$20,MATCH($C$2,'Shi Segment (Peter)'!$A$3:$A$20,0))","v":0}]
["Red - Data/value not good (Source)","Prominent Category",{"$f":"INDEX('Shi Segment (Peter)'!$D$3:$D$20,MATCH($C$2,'Shi Segment (Peter)'!$A$3:$A$20,0))","v":"MVS 110m"}]
["Dark blue - Not used/ reference value","Sailing hours",{"$f":"'Ship segment (Data)'!AA5","v":"normal fuel use"}]
["Pink - Recheck the calculations","Average Propulsion power (kW) ",{"$f":"INDEX('Shi Segment (Peter)'!$I$3:$I$20,MATCH($C$2,'Shi Segment (Peter)'!$A$3:$A$20,0))","v":1527}]
[]
{"$rows_left_out":110}
{"sheet":"Results","index":5,"n_rows":200,"n_cols":42,"rows_kept":200,"cut":false,"hidden":true,"merged":[]}
[]
[]
[null,"Cost factors","CCNR2 revision","CCNRO revision","Stage V","LNG mono fuel","LNG Dual fuel refit","SCR CCNR2","SCR CCNR0","SCR+ DPF CCNR2","SCR+DPF CCNR0","Diesel electric","Battery electric","FWE CCNR2","FWE CCNR0","GTL CCNR2","GTL CCNR0",null,null,"CCR 2",{"$f":"C3","v":"CCNR2 revision"},{"$f":"E3","v":"Stage V"},{"$f":"F3","v":"LNG mono fuel"},{"$f":"G3","v":"LNG Dual fuel refit"},{"$f":"H3","v":"SCR CCNR2"},{"$f":"J3","v":"SCR+ DPF CCNR2"},{"$f":"L3","v":"Diesel electric"},{"$f":"M3","v":"Battery electric"},{"$f":"N3","v":"FWE CCNR2"},{"$f":"P3","v":"GTL CCNR2"},null,"CCR 0",{"$f":"D3","v":"CCNRO revision"},{"$f":"E3","v":"Stage V"},{"$f":"F3","v":"LNG mono fuel"},{"$f":"G3","v":"LNG Dual fuel refit"},{"$f":"I3","v":"SCR CCNR0"},{"$f":"K3","v":"SCR+DPF CCNR0"},{"$f":"L3","v":"Diesel electric"},{"$f":"M3","v":"Battery electric"},{"$f":"O3","v":"FWE CCNR0"},{"$f":"Q3","v":"GTL CCNR0"}]
[{"$f":"'Ship segment (Data)'!$Z$5&\"&\"&'Ship segment (Data)'!$AA$5","v":"Motor vessels dry cargo 110 m ship&normal fuel use"},"Investments in start year",{"$f":"'CBA figures'!D99","v":0},{"$f":"'CBA figures'!E99","v":0},{"$f":"'CBA figures'!C99","v":609082.01428571425},{"$f":"'CBA figures'!G99","v":1923862},{"$f":"'CBA figures'!H99","v":996097},{"$f":"'CBA figures'!K99","v":87031.607142857145},{"$f":"'CBA figures'!L99","v":87031.607142857145},{"$f":"'CBA figures'!O99","v":161784.60714285713},{"$f":"'CBA figures'!P99","v":161784.60714285713},{"$f":"'CBA figures'!S99","v":1099547.54},{"$f":"IF('Ship segment (Data)'!$AC$5=\"nee\",'CBA figures'!T99*10^3,'CBA figures'!T99)","v":2732989.2390595516},{"$f":"'CBA figures'!W99","v":148636.83314285713},{"$f":"'CBA figures'!X99","v":148636.83314285713},{"$f":"'CBA figures'!AA99","v":0},{"$f":"'CBA figures'!AB99","v":0},null,null,{"$f":"B4","v":"Investments in start year"},0,609082.01428571425,1923862,996097,87031.607142857145,161784.60714285713,1099547.54,2732989.2390595516,148636.83314285713,0,null,{"$f":"B4","v":"Investments in start year"},0,609082.01428571425,1923862,996097,87031.607142857145,161784.60714285713,1099547.54,2732989.2390595516,148636.83314285713,0]
[{"$f":"'Ship segment (Data)'!$Z$5&\"&\"&'Ship segment (Data)'!$AA$5","v":"Motor vessels dry cargo 110 m ship&normal fuel use"},"Revision costs in start year",{"$f":"'CBA figures'!D100","v":171826.60714285713},{"$f":"'CBA figures'!E100","v":171826.60714285713},{"$f":"'CBA figures'!C100","v":0},{"$f":"'CBA figures'!G100","v":0},{"$f":"'CBA figures'!H100","v":0},{"$f":"'CBA figures'!K100","v":171826.60714285713},{"$f":"'CBA figures'!L100","v":171826.60714285713},{"$f":"'CBA figures'!O100","v":171826.60714285713},{"$f":"'CBA figures'!P100","v":171826.60714285713},{"$f":"'CBA figures'!S100","v":0},{"$f":"'CBA figures'!T100","v":0},{"$f":"'CBA figures'!W100","v":171826.60714285713},{"$f":"'CBA figures'!X100","v":171826.60714285713},{"$f":"'CBA figures'!AA100","v":171826.60714285713},{"$f":"'CBA figures'!AB100","v":171826.60714285713},null,null,"Revision costs in start year",171826.60714285713,0,0,0,171826.60714285713,171826.60714285713,0,0,171826.60714285713,171826.60714285713,null,"Revision costs in start year",171826.60714285713,0,0,0,171826.60714285713,171826.60714285713,0,0,171826.60714285713,171826.60714285713]
[{"$f":"'Ship segment (Data)'!$Z$5&\"&\"&'Ship segment (Data)'!$AA$5","v":"Motor vessels dry cargo 110 m ship&normal fuel use"},"Investments in assessment period",{"$f":"IF($S$44=\"YES\",'CBA figures'!D101,'CBA figures'!D113)","v":100782.00000000003},{"$f":"IF($S$44=\"YES\",'CBA figures'!E101,'CBA figures'!E113)","v":100782.00000000003},{"$f":"IF($S$44=\"YES\",'CBA figures'!C101,'CBA figures'!C113)","v":0},{"$f":"IF($S$44=\"YES\",'CBA figures'!G101,'CBA figures'!G113)","v":0},{"$f":"IF($S$44=\"YES\",'CBA figures'!H101,'CBA figures'!H113)","v":100782.00000000003},{"$f":"IF($S$44=\"YES\",'CBA figures'!K101,'CBA figures'!K113)","v":100782.00000000003},{"$f":"IF($S$44=\"YES\",'CBA figures'!L101,'CBA figures'!L113)","v":100782.00000000003},{"$f":"IF($S$44=\"YES\",'CBA figures'!O101,'CBA figures'!O113)","v":100782.00000000003},{"$f":"IF($S$44=\"YES\",'CBA figures'!P101,'CBA figures'!P113)","v":100782.00000000003},{"$f":"IF($S$44=\"YES\",'CBA figures'!S101,'CBA figures'!S113)","v":0},null,{"$f":"IF($S$44=\"YES\",'CBA figures'!W101,'CBA figures'!W113)","v":100782.00000000003},{"$f":"IF($S$44=\"YES\",'CBA figures'!X101,'CBA figures'!X113)","v":100782.00000000003},{"$f":"IF($S$44=\"YES\",'CBA figures'!AA101,'CBA figures'!AA113)","v":100782.00000000003},{"$f":"IF($S$44=\"YES\",'CBA figures'!AB101,'CBA figures'!AB113)","v":100782.00000000003},null,null,{"$f":"B6","v":"Investments in assessment period"},100782.00000000003,{"$f":"E6","v":0},0,100782.00000000003,100782.00000000003,{"$f":"J6","v":100782.00000000003},{"$f":"L6","v":0},0,100782.00000000003,100782.00000000003,null,"Investments in assessment period",100782.00000000003,0,0,100782.00000000003,100782.00000000003,100782.00000000003,0,0,100782.00000000003,100782.00000000003]
[{"$f":"'Ship segment (Data)'!$Z$5&\"&\"&'Ship segment (Data)'!$AA$5","v":"Motor vessels dry cargo 110 m ship&normal fuel use"},"Revision costs in assesment period (incl SCR/ DPF)",{"$f":"'CBA figures'!D102","v":0},{"$f":"'CBA figures'!E102","v":0},{"$f":"'CBA figures'!C102","v":0},{"$f":"'CBA figures'!G102","v":0},{"$f":"'CBA figures'!H102","v":0},{"$f":"'CBA figures'!K102","v":0},{"$f":"'CBA figures'!L102","v":0},{"$f":"'CBA figures'!O102","v":0},{"$f":"'CBA figures'!P102","v":0},{"$f":"'CBA figures'!S102","v":0},{"$f":"'CBA figures'!T102","v":0},{"$f":"'CBA figures'!W102","v":0},{"$f":"'CBA figures'!X102","v":0},{"$f":"'CBA figures'!AA102","v":0},{"$f":"'CBA figures'!AB102","v":0},null,null,"Revision costs in assesment period (incl SCR/ DPF)",0,0,0,0,0,0,0,0,0,0,null,"Revision costs in assesment period (incl SCR/ DPF)",0,0,0,0,0,0,0,0,0,0]
[{"$f":"'Ship segment (Data)'!$Z$5&\"&\"&'Ship segment (Data)'!$AA$5","v":"Motor vessels dry cargo 110 m ship&normal fuel use"},"Fuel (+ Urea)",{"$f":"'CBA figures'!D103","v":2088289.8487655541},{"$f":"'CBA figures'!E103","v":2068401.3740154058},{"$f":"'CBA figures'!C103","v":2027197.7046621577},{"$f":"'CBA figures'!G103","v":1488015.1335323923},{"$f":"'CBA figures'!H103","v":1513113.3819056167},{"$f":"'CBA figures'!K103","v":2128557.5898952656},{"$f":"'CBA figures'!L103","v":2143184.3218277274},{"$f":"'CBA figures'!O103","v":2128557.5898952656},{"$f":"'CBA figures'!P103","v":2143184.3218277274},{"$f":"'CBA figures'!S103","v":2027197.7046621577},{"$f":"'CBA figures'!T103","v":842400.34259097313},{"$f":"'CBA figures'!W103","v":1983875.3563272762},{"$f":"'CBA figures'!X103","v":1983875.3563272762},{"$f":"'CBA figures'!AA103","v":2298427.0166514008},{"$f":"'CBA figures'!AB103","v":2298427.0166514008},null,null,"Fuel (+ Urea)",2088289.8487655541,2027197.7046621577,1488015.1335323923,1513113.3819056167,2128557.5898952656,2128557.5898952656,2027197.7046621577,842400.34259097313,1983875.3563272762,2298427.0166514008,null,"Fuel (+ Urea)",2068401.3740154058,2027197.7046621577,1488015.1335323923,1513113.3819056167,2143184.3218277274,2143184.3218277274,2027197.7046621577,842400.34259097313,1983875.3563272762,2298427.0166514008]
{"$rows_left_out":193}
{"sheet":"Key Data","index":6,"n_rows":205,"n_cols":37,"rows_kept":205,"cut":false,"hidden":true,"merged":[[1,0,1,3]]}
[]
["Key data"]
[]
["General data/Details - LNG (Mono & Dual fuel)","#","Units","Source","Type of costs"]
["Fuel price",{"$f":"N9","v":583},"Euro per 1000 liter","CBRB five year average price https://www.zandmij.nl/logistiek/cbrb"]
["Fuel price (Diesel/100KG)",{"$f":"B5/B42","v":697.39693356047701},"Per 1000 KG","http://www.interrijn.com/","operational"]
["Fuel Price (Diesel/Ton)",{"$f":"B6","v":697.39693356047701},"Per Ton","http://www.interrijn.com/",{"$f":"E6","v":"operational"}]
["Fuel price (Diesel/Lt)",{"$f":"70.11/100","v":0.70109999999999995},"€ /lt","http://www.interrijn.com/ (70.11 euro for 100 Lt on 16/11/2018)",{"$f":"E7","v":"operational"},null,null,2015,2016,2017,2018,2019,2020,"Average"]
{"$rows_left_out":198}
{"sheet":"Emission factors","index":7,"n_rows":27,"n_cols":24,"rows_kept":27,"cut":false,"hidden":true,"merged":[[9,1,11,1],[17,1,19,1],[20,1,22,1],[15,1,16,1],[3,1,8,1],[12,1,14,1]]}
[]
[null,null,null,null,null,null,null,null,null,null,null,null,null,"Nox"]
[null,null,"g/kwh","Nox","PM",null,"Compared to Diesel","Nox","PM",null,null,null,null,"Engine type","Revision","Stage V","LNG mono fuel","LNG Dual fuel refit","SCR","SCR + DPF","Diesel electric","Battery electric","FWE","GTL"]
[null,"Diesel","CCNRO/1",9.93,{"$f":"(E5+E6)/2","v":0.26500000000000001},null,null,null,null,null,null,null,null,"unregulated",{"$f":"D5","v":11.8},{"$f":"D8","v":1.79},{"$f":"D17","v":1.79},{"$f":"D16","v":2.77},{"$f":"D10","v":3.5400000000000009},{"$f":"S4","v":3.5400000000000009},{"$f":"P4","v":1.79},{"$f":"U4","v":1.79},{"$f":"D18","v":10.030000000000001},{"$f":"D21","v":10.620000000000001}]
[null,null,"CCNRO",11.8,0.4,null,{"$f":"B10","v":"SCR/DPF"},0.7,0.9,null,null,null,null,"CCR1",{"$f":"D6","v":9.1999999999999993},{"$f":"P4","v":1.79},{"$f":"Q4","v":1.79},2.77,{"$f":"D11","v":2.7600000000000002},{"$f":"S5","v":2.7600000000000002},{"$f":"P5","v":1.79},{"$f":"U5","v":1.79},{"$f":"D19","v":7.8199999999999994},{"$f":"D22","v":8.2799999999999994}]
[null,null,"CCNR1",9.1999999999999993,0.13,null,{"$f":"B18","v":"FWE"},0.15,0.5,null,null,null,null,"CCR2",{"$f":"D7","v":6.73},{"$f":"P5","v":1.79},{"$f":"Q5","v":1.79},{"$f":"R5","v":2.77},2.0190000000000006,2.0190000000000006,1.79,1.79,5.7205000000000004,6.0570000000000004]
[null,null,"CCNR2",6.73,0.13,null,{"$f":"B21","v":"GTL"},0.1,0.7]
[null,null,"Stage V",{"$f":"'Key Data'!B31","v":1.79},1.4999999999999999E-2,null,null,null,null,null,null,null,null,"PM"]
{"$rows_left_out":20}
{"sheet":"Ship segment (Data)","index":8,"n_rows":138,"n_cols":37,"rows_kept":138,"cut":false,"hidden":true,"merged":[[36,1,36,3],[35,13,35,15],[56,18,56,20],[56,21,56,23]]}
[null,"source: PROMINENT D2.2"]
["CE Delft Segment","Fleet family ","Vessel type ",null,"Length (m) ","Width (m) ","Draught (m) ","Max pay-load (t) ","Operational hours/year ","# en-gines ","Installed kW ","Fuel cons. (M3) ",null,"Average engine load",null,"Segment",null,null,"M3 / Kwh"]
[{"$f":"'Ship segment (Data)'!B85","v":"A1"},{"$f":"'Ship segment (Data)'!C85","v":"Passenger vessel <250 kW"},null,null,null,null,null,null,{"$f":"'Ship segment (Data)'!I85/0.5","v":1880},{"$f":"'Ship segment (Data)'!G85/'Ship segment (Data)'!F85","v":1.1621737623351607},{"$f":"'Ship segment (Data)'!J85","v":125.97336642465551},{"$f":"K3*I3*$S$3","v":10.650549831187348},null,{"$f":"(L3*'Key Data'!$B$43*1000/3.6)/K3/I3","v":0.44795412461794071},null,null,null,null,{"$f":"SUM(L8:L34)/SUMPRODUCT($K$8:$K$34,$I$8:$I$34)","v":4.4971300213741149E-5}]
[{"$f":"'Ship segment (Data)'!B86","v":"A2"},{"$f":"'Ship segment (Data)'!C86","v":"Passenger vessel 250 - 500 kW"},null,null,null,null,null,null,{"$f":"'Ship segment (Data)'!I86/0.5","v":1390},{"$f":"'Ship segment (Data)'!G86/'Ship segment (Data)'!F86","v":1.5065407863157894},{"$f":"'Ship segment (Data)'!J86","v":429.4484210526316},{"$f":"K4*I4*$S$3","v":26.844866878570265},null,{"$f":"(L4*'Key Data'!$B$43*1000/3.6)/K4/I4","v":0.44795412461794071},null,null,null,null,null,null,null,null,"Period","Scenario",null,"Vessel type","Fuel use",null,"ZE meenemen?","Afschrijving? "]
[{"$f":"'Ship segment (Data)'!B87","v":"A3"},{"$f":"'Ship segment (Data)'!C87","v":"Passenger vessel 500 - 1000 kW"},null,null,null,null,null,null,{"$f":"'Ship segment (Data)'!I87/0.5","v":1470},{"$f":"'Ship segment (Data)'!G87/'Ship segment (Data)'!F87","v":1.81586982473223},{"$f":"'Ship segment (Data)'!J87","v":693.02142161635834},{"$f":"K5*I5*$S$3","v":45.814129376912504},null,{"$f":"(L5*'Key Data'!$B$43*1000/3.6)/K5/I5","v":0.44795412461794071},null,null,null,null,null,null,null,null,15,{"$f":"Invoer_waarden!D41&Invoer_waarden!G41","v":"Motor vessels dry cargo 110 m shipnormal fuel use"},null,{"$f":"INDEX('Ship segment (Data)'!AC$85:AC$138,MATCH('Ship segment (Data)'!$X$5,scenario_names,0))","v":"Motor vessels dry cargo 110 m ship"},{"$f":"INDEX('Ship segment (Data)'!AD$85:AD$138,MATCH('Ship segment (Data)'!$X$5,scenario_names,0))","v":"normal fuel use"},null,"ja","met restwaarde"]
[{"$f":"'Ship segment (Data)'!B101","v":"N"},{"$f":"'Ship segment (Data)'!C101","v":"Ferry"},null,null,null,null,null,null,{"$f":"'Ship segment (Data)'!I101","v":750},{"$f":"'Ship segment (Data)'!G101/'Ship segment (Data)'!F101","v":2.1875},{"$f":"'Ship segment (Data)'!J101","v":644},{"$f":"K6*I6*$S$3","v":21.721138003236973},null,{"$f":"(L6*'Key Data'!$B$43*1000/3.6)/K6/I6","v":0.44795412461794065}]
[{"$f":"'Ship segment (Data)'!B102","v":"O"},{"$f":"'Ship segment (Data)'!C102","v":"tugboat and workboat"},null,null,null,null,null,null,{"$f":"'Ship segment (Data)'!I102","v":916},{"$f":"'Ship segment (Data)'!G102/'Ship segment (Data)'!F102","v":1.2489999999999999},{"$f":"'Ship segment (Data)'!J102","v":500},20.596855497893447,null,{"$f":"(L7*'Key Data'!$B$43*1000/3.6)/K7/I7","v":0.44795412461794071}]
["A4","Passenger vessels (hotel/cruise) ","PAX 135m ",null,135,11.5,2,"NA",4318,{"$f":"'Ship segment (Data)'!G88/'Ship segment (Data)'!F88","v":2.3901162222222223},{"$f":"'Ship segment (Data)'!J88","v":1492},433,null,{"$f":"(L8*'Key Data'!$B$43*1000/3.6)/K8/I8","v":0.66947525740011093},null,1,null,"a","Propulsion power 200-600"]
{"$rows_left_out":131}
{"sheet":"Shi Segment (Peter)","index":9,"n_rows":56,"n_cols":36,"rows_kept":56,"cut":false,"hidden":true,"merged":[]}
[]
["CE Delft Segment","Vessel class ","Propulsion power range (kW)","Corresponding PROMINENT Category (D3.5 table 4.2)","Number of vessels (Prominent & IVR based)","Number of engines (Prominent & IVR based)","Average total propulsion power (IVR based)","Sailing hours (STC Nestra)","kW according to Prominent ","Idling costs (€ per day)","Port dues (€ per annum)","Additional engine costs mono fuel LNG engine (compared to diesel) (€)","Additional engine costs dual fuel LNG engine (compared to diesel) (€)","Installation costs (tank above deck) (€)","Installation costs (tank below deck) (€)",null,null,"Idling cost per kW","Port dues","Additional engine costs mono fuel LNG engine (compared to diesel) (€)","Additional engine costs dual fuel LNG engine (compared to diesel) (€)","Installation costs (tank above deck) (€)","Installation costs (tank below deck) (€)",null,null,null,null,"Vessel type iteraties","Fuel use","Year","ZE meenemen","Afschrijving",null,null,"NPV","Fuel use"]
["A1","Passenger vessel <250 kW",null,{"$f":"D7","v":"PB< 500 kW B04"},521,605.49253017661874,125.97336642465551,940,{"$f":"G3","v":125.97336642465551},{"$f":"R$6*$I3","v":343.93901285498328},4221.6275611479723,79915.40973253113,24316.574752212324,47493.310062914694,68390.366490597153,null,null,null,null,null,null,null,null,null,null,null,{"$f":"AB3&AC3","v":"Passenger vessel <250 kWnormal fuel use"},"Passenger vessel <250 kW","normal fuel use",15,"ja","zonder restwaarde",null,"Passenger vessel <250 kW",15,1]
["A2","Passenger vessel 250 - 500 kW",null,{"$f":"D7","v":"PB< 500 kW B04"},227,341.98475849368418,429.4484210526316,695,{"$f":"G4","v":429.4484210526316},1172.5023328428308,14391.703118385776,272434.94003104279,82896.209961902074,161906.66008183997,233145.59051784957,null,null,null,null,null,null,null,null,null,null,null,"Passenger vessel 250 - 500 kWnormal fuel use","Passenger vessel 250 - 500 kW","normal fuel use",15,"nee","met restwaarde",null,"Passenger vessel 250 - 500 kW",null,0.43]
["A3","Passenger vessel 500 - 1000 kW",null,null,60,108.95218948393381,693.02142161635834,735,{"$f":"G5","v":693.02142161635834},1892.1229971308935,23224.578472398065,439641.27048249543,133773.57200101286,261276.50781447825,376238.17125284864,null,null,null,null,null,null,null,null,null,null,null,"Passenger vessel 500 - 1000 kWnormal fuel use","Passenger vessel 500 - 1000 kW","normal fuel use",15,null,null,null,"Passenger vessel 500 - 1000 kW",null,1.75]
["A4","Passenger vessel >1000 kW",{"$f":"RIGHT(B6,8)","v":">1000 kW"},"PAX 135m",155,370.46801444444446,1518.851851851852,1750,1492,{"$f":"114059/4/7","v":4073.5357142857142},50000,946500,288000,562500,810000,null,"Passenger vessel",{"$f":"J6/$I6","v":2.7302518192263499},33.512064343163537,634.38337801608577,193.02949061662198,377.01072386058979,542.89544235924927,null,null,null,"Passenger vessel >1000 kWnormal fuel use","Passenger vessel >1000 kW","normal fuel use",15,null,null,null,"Passenger vessel >1000 kW"]
["B","Push boats <500 kW ",{"$f":"RIGHT(B7,8)","v":"<500 kW "},"PB< 500 kW B04",155,185.99999999999997,247,1420,400,{"$f":"R8*$I7","v":231.39654580807502},3345,{"$f":"T8*$I7","v":286893.51481184951},{"$f":"U8*$I7","v":92233.787029623709},{"$f":"V8*$I7","v":174539.6317053643},{"$f":"W8*$I7","v":231385.10808646915},null,null,null,null,null,null,null,null,null,null,null,"Push boats <500 kW normal fuel use","Push boats <500 kW ","normal fuel use",15,null,null,null,"Push boats <500 kW "]
["C","Push boats 500-2000 kW ",{"$f":"RIGHT(B8,8)","v":"2000 kW "},"Push B2L & Push BII-1",92,147.20000000000002,846.90068493150682,3000,1249,{"$f":"20231/4/7","v":722.53571428571433},52197,895825,288000,545000,722500,null,"Push boats",{"$f":"J8/$I8","v":0.57849136452018757},null,{"$f":"L8/$I8","v":717.23378702962373},230.58446757405926,436.34907926341072,578.46277021617288,null,null,null,"Push boats 500-2000 kW normal fuel use","Push boats 500-2000 kW ","normal fuel use",15,null,null,null,"Push boats 500-2000 kW "]
{"$rows_left_out":48}